BDBM329693 US9663519, Compound I-33
SMILES Cc1nsc(NC(=O)c2c(N)nn3cc4CN(CCc4nc23)C2COC2)c1C1CC1
InChI Key InChIKey=MQGOYYWLMSQRES-UHFFFAOYSA-N
Data  1 KI
  Tab Delimited (TSV)   2D SDfile   Computed 3D by Vconf -m prep SDfile
Find this compound or compounds like it in BindingDB:
Activity Spreadsheet -- Enzyme Inhibition Constant Data from BindingDB
Found 1 hit for monomerid = 329693
TargetSerine/threonine-protein kinase ATR(Homo sapiens (Human))
Vertex Pharmaceuticals
US Patent
LigandPNGBDBM329693(US9663519, Compound I-33)
Affinity DataKi:  505nM. Assay description: Compounds were screened for their ability to inhibit ATR kinase using a radioactive-phosphate incorporation assay. Assays were carried out in a mixtu...
Ligand InfoPC cidPC sid
In DepthDetails US Patent