BDBM329705 1-(1-(2-chloro-6- (trifluoromethyl)benzoyl)-1H- pyrazolo[4,3- b]pyridin-3-yl)- 1,2,3,6- tetrahydropyridine- 4-carboxylic acid::US9663522, 1L
SMILES OC(=O)C1=CCN(CC1)c1nn(C(=O)c2c(Cl)cccc2C(F)(F)F)c2cccnc12
InChI Key InChIKey=UBCOEZRIQSJVCE-UHFFFAOYSA-N
Data  1 IC50
  Tab Delimited (TSV)   2D SDfile   Computed 3D by Vconf -m prep SDfile
Find this compound or compounds like it in BindingDB:
Activity Spreadsheet -- Enzyme Inhibition Constant Data from BindingDB
Found 1 hit for monomerid = 329705
TargetNuclear receptor ROR-gamma(Homo sapiens (Human))
Merck Sharp & Dohme
US Patent
LigandPNGBDBM329705(1-(1-(2-chloro-6- (trifluoromethyl)benzoyl)-1H- py...)
Affinity DataIC50:  306nM. Assay description: The compounds of the invention inhibit RORgammaT activity. Activation of RORgammaT activity can be measured using, e.g., biochemical TR-FRET assay. I...
Ligand InfoPC cidPC sid
In DepthDetails US Patent