BDBM330012 US9663526, Example 95
SMILES C[C@@H]1[C@@H]2CN(C[C@]12NC(=O)[C@@H]1C[C@H]1[N+]#[C-])c1nc(Nc2cnn(C)c2)ncc1F
InChI Key InChIKey=CFQOECVDRKCVAD-FBMDRFKXSA-N
Data  4 IC50
  Tab Delimited (TSV)   2D SDfile   Computed 3D by Vconf -m prep SDfile
Find this compound or compounds like it in BindingDB:
Activity Spreadsheet -- Enzyme Inhibition Constant Data from BindingDB
Found 4 hits for monomerid = 330012
TargetNon-receptor tyrosine-protein kinase TYK2(Homo sapiens (Human))
Pfizer
US Patent
LigandPNGBDBM330012(US9663526, Example 95)
Affinity DataIC50:  35nM. Assay description: Compounds were added to a 384-well plate. Reaction mixtures contained 10 mM HEPES, pH 7.4, 10 mM MgCl2, 0.01% BSA, 0.0005% Tween 20, 1 mM ATP and 1 &...
Ligand InfoPC cidPC sid
In DepthDetails US Patent
TargetTyrosine-protein kinase JAK3(Homo sapiens (Human))
Pfizer
US Patent
LigandPNGBDBM330012(US9663526, Example 95)
Affinity DataIC50:  255nM
Ligand InfoPC cidPC sid
In DepthDetails US Patent
TargetTyrosine-protein kinase JAK2(Homo sapiens (Human))
Pfizer
US Patent
LigandPNGBDBM330012(US9663526, Example 95)
Affinity DataIC50:  228nM
Ligand InfoPC cidPC sid
In DepthDetails US Patent
TargetTyrosine-protein kinase JAK1(Homo sapiens (Human))
Pfizer
US Patent
LigandPNGBDBM330012(US9663526, Example 95)
Affinity DataIC50:  11nM
Ligand InfoPC cidPC sid
In DepthDetails US Patent