BDBM330076 N-(5H-chromeno[3,4- c]pyridin-8-yl)-2- o-tolylacetamide::US9663529, Example I-15
SMILES Cc1ccccc1CC(=O)Nc1ccc-2c(OCc3cnccc-23)c1
InChI Key InChIKey=IDZWFKJRYUWVJY-UHFFFAOYSA-N
Data  1 IC50
  Tab Delimited (TSV)   2D SDfile   Computed 3D by Vconf -m prep SDfile
Find this compound or compounds like it in BindingDB:
Activity Spreadsheet -- Enzyme Inhibition Constant Data from BindingDB
Found 1 hit for monomerid = 330076
TargetRho-associated protein kinase 2(Homo sapiens (Human))
Bristol-Myers Squibb
US Patent
LigandPNGBDBM330076(N-(5H-chromeno[3,4- c]pyridin-8-yl)-2- o-tolylacet...)
Affinity DataIC50:  16.7nM. Assay description: The effectiveness of compounds of the present invention as ROCK inhibitors can be determined in a 30 μL assay containing 20 mM HEPES, pH 7.5, 20...
Ligand InfoPC cidPC sid
In DepthDetails US Patent