BDBM330165 1-(2-Chlorophenyl)-3-[4-[[(1S,4S)-5-oxa-2-azabicyclo[2.2.1]heptan-4-yl]methyl]phenyl]urea::US9663530, Example 9
SMILES Clc1ccccc1NC(=O)Nc1ccc(C[C@]23CN[C@H](CO2)C3)cc1
InChI Key InChIKey=CVWOYADAROOFKH-KXBFYZLASA-N
Data  2 IC50
  Tab Delimited (TSV)   2D SDfile   Computed 3D by Vconf -m prep SDfile
Find this compound or compounds like it in BindingDB:
Activity Spreadsheet -- Enzyme Inhibition Constant Data from BindingDB
Found 2 hits for monomerid = 330165
TargetTrace amine-associated receptor 1(Rattus norvegicus (Rat))
Hoffmann-La Roche
US Patent
LigandPNGBDBM330165(1-(2-Chlorophenyl)-3-[4-[[(1S,4S)-5-oxa-2-azabicyc...)
Affinity DataIC50:  530nM. Assay description: HEK-293 cells stably expressing mouse TAAR1 were maintained at 37° C. and 5% CO2 in DMEM high glucose medium, containing fetal calf serum (10%, heat ...
Ligand InfoPC cidPC sid
In DepthDetails US Patent
TargetTrace amine-associated receptor 1(Mus musculus (Mouse))
Hoffmann-La Roche
US Patent
LigandPNGBDBM330165(1-(2-Chlorophenyl)-3-[4-[[(1S,4S)-5-oxa-2-azabicyc...)
Affinity DataIC50:  1.63E+3nM. Assay description: HEK-293 cells stably expressing rat TAAR1 were maintained at 37° C. and 5% CO2 in DMEM high glucose medium, containing fetal calf serum (10%, heat in...
Ligand InfoPC cidPC sid
In DepthDetails US Patent