BDBM330190 (RS)-4-Chloro-N-[4-(5-oxa-2-azabicyclo[2.2.2]octan-4-yl)phenyl]-3-propyl-1H-pyrazole-5-carboxamide::US9663530, Example 34
SMILES CCCc1n[nH]c(C(=O)Nc2ccc(cc2)C23CCC(CO2)NC3)c1Cl
InChI Key
Data  2 IC50
  Tab Delimited (TSV)   2D SDfile   Computed 3D by Vconf -m prep SDfile
Find this compound or compounds like it in BindingDB:
Activity Spreadsheet -- Enzyme Inhibition Constant Data from BindingDB
Found 2 hits for monomerid = 330190
TargetTrace amine-associated receptor 1(Rattus norvegicus (Rat))
Hoffmann-La Roche
US Patent
LigandPNGBDBM330190((RS)-4-Chloro-N-[4-(5-oxa-2-azabicyclo[2.2.2]octan...)
Affinity DataIC50:  97.3nM. Assay description: HEK-293 cells stably expressing mouse TAAR1 were maintained at 37° C. and 5% CO2 in DMEM high glucose medium, containing fetal calf serum (10%, heat ...
Ligand InfoPC cidPC sid
In DepthDetails US Patent
TargetTrace amine-associated receptor 1(Mus musculus (Mouse))
Hoffmann-La Roche
US Patent
LigandPNGBDBM330190((RS)-4-Chloro-N-[4-(5-oxa-2-azabicyclo[2.2.2]octan...)
Affinity DataIC50:  13.5nM. Assay description: HEK-293 cells stably expressing rat TAAR1 were maintained at 37° C. and 5% CO2 in DMEM high glucose medium, containing fetal calf serum (10%, heat in...
Ligand InfoPC cidPC sid
In DepthDetails US Patent