BDBM330198 5-Chloro-N-[4-[[(1R,4R)-5-oxa-2-azabicyclo[2.2.1]heptan-4-yl]methyl]phenyl]pyridin-2-amine::US9663530, Example 42::US9663530, Example 64
SMILES Clc1ccc(Nc2ccc(C[C@@]34CN[C@@H](CO3)C4)cc2)nc1
InChI Key InChIKey=YCSXPCROXXBQFF-NVXWUHKLSA-N
Data  4 IC50
  Tab Delimited (TSV)   2D SDfile   Computed 3D by Vconf -m prep SDfile
Find this compound or compounds like it in BindingDB:
Activity Spreadsheet -- Enzyme Inhibition Constant Data from BindingDB
Found 4 hits for monomerid = 330198
TargetTrace amine-associated receptor 1(Mus musculus (Mouse))
Hoffmann-La Roche
US Patent
LigandPNGBDBM330198(5-Chloro-N-[4-[[(1R,4R)-5-oxa-2-azabicyclo[2.2.1]h...)
Affinity DataIC50:  15.8nM. Assay description: HEK-293 cells stably expressing rat TAAR1 were maintained at 37° C. and 5% CO2 in DMEM high glucose medium, containing fetal calf serum (10%, heat in...
Ligand InfoPC cidPC sid
In DepthDetails US Patent
TargetTrace amine-associated receptor 1(Rattus norvegicus (Rat))
Hoffmann-La Roche
US Patent
LigandPNGBDBM330198(5-Chloro-N-[4-[[(1R,4R)-5-oxa-2-azabicyclo[2.2.1]h...)
Affinity DataIC50:  7.68E+3nM. Assay description: HEK-293 cells stably expressing mouse TAAR1 were maintained at 37° C. and 5% CO2 in DMEM high glucose medium, containing fetal calf serum (10%, heat ...
Ligand InfoPC cidPC sid
In DepthDetails US Patent
TargetTrace amine-associated receptor 1(Mus musculus (Mouse))
Hoffmann-La Roche
US Patent
LigandPNGBDBM330198(5-Chloro-N-[4-[[(1R,4R)-5-oxa-2-azabicyclo[2.2.1]h...)
Affinity DataIC50:  30nM. Assay description: HEK-293 cells stably expressing rat TAAR1 were maintained at 37° C. and 5% CO2 in DMEM high glucose medium, containing fetal calf serum (10%, heat in...
Ligand InfoPC cidPC sid
In DepthDetails US Patent
TargetTrace amine-associated receptor 1(Rattus norvegicus (Rat))
Hoffmann-La Roche
US Patent
LigandPNGBDBM330198(5-Chloro-N-[4-[[(1R,4R)-5-oxa-2-azabicyclo[2.2.1]h...)
Affinity DataIC50:  355nM. Assay description: HEK-293 cells stably expressing mouse TAAR1 were maintained at 37° C. and 5% CO2 in DMEM high glucose medium, containing fetal calf serum (10%, heat ...
Ligand InfoPC cidPC sid
In DepthDetails US Patent