BDBM330351 2-(3-{[(3R,6R)-6-Methyl-1-{[2-(2H-1,2,3-triazol-2-yl)phenyl]carbonyl}piperidin-3-yl]oxy}phenyl)propan-2-ol::US9725434, 6
SMILES C[C@@H]1CC[C@H](CN1C(=O)c1ccccc1-n1nccn1)Oc1cccc(c1)C(C)(C)O
InChI Key InChIKey=QZNKQAYRHRQDOQ-YLJYHZDGSA-N
Data  2 IC50
  Tab Delimited (TSV)   2D SDfile   Computed 3D by Vconf -m prep SDfile
Find this compound or compounds like it in BindingDB:
Activity Spreadsheet -- Enzyme Inhibition Constant Data from BindingDB
Found 2 hits for monomerid = 330351
TargetOrexin/Hypocretin receptor type 1(Homo sapiens (Human))
Merck Sharp & Dohme
US Patent
LigandPNGBDBM330351(2-(3-{[(3R,6R)-6-Methyl-1-{[2-(2H-1,2,3-triazol-2-...)
Affinity DataIC50:  1.00E+4nM. Assay description: The following table shows representative data for the compounds of the Examples as orexin receptor antagonists as determined by the FLIPR Ca2+ Flux A...
Ligand InfoPC cidPC sid
In DepthDetails US Patent
TargetOrexin receptor type 2(Homo sapiens (Human))
Merck Sharp & Dohme
US Patent
LigandPNGBDBM330351(2-(3-{[(3R,6R)-6-Methyl-1-{[2-(2H-1,2,3-triazol-2-...)
Affinity DataIC50:  32nM. Assay description: The following table shows representative data for the compounds of the Examples as orexin receptor antagonists as determined by the FLIPR Ca2+ Flux A...
Ligand InfoPC cidPC sid
In DepthDetails US Patent