BDBM330442 US9725442, Compound I-77
SMILES C[C@H]1C[C@H](CCN1S(=O)(=O)c1ccc(F)cc1)n1nc(CC(O)=O)c2ccc(F)cc12
InChI Key InChIKey=MHTNRHZHLZYDAD-BBRMVZONSA-N
Data  2 KI
  Tab Delimited (TSV)   2D SDfile   Computed 3D by Vconf -m prep SDfile
Find this compound or compounds like it in BindingDB:
Activity Spreadsheet -- Enzyme Inhibition Constant Data from BindingDB
Found 2 hits for monomerid = 330442
TargetProstaglandin D2 receptor 2(Homo sapiens (Human))
Shionogi
US Patent
LigandPNGBDBM330442(US9725442, Compound I-77)
Affinity DataKi:  48nM. Assay description: Cell membrane was prepared from CRTH2-expressing K562 cell. The cell membrane (20 μg/well) was mixed with reaction buffer (50 mM Tris/HCl, pH 7....
Ligand InfoPC cidPC sid
In DepthDetails US Patent
TargetProstaglandin D2 receptor 2(Homo sapiens (Human))
Shionogi
US Patent
LigandPNGBDBM330442(US9725442, Compound I-77)
Affinity DataKi: <100nM. Assay description: Cell membrane was prepared from CRTH2-expressing K562 cell. The cell membrane (20 μg/well) was mixed with reaction buffer (50 mM Tris/HCl, pH 7....
Ligand InfoPC cidPC sid
In DepthDetails US Patent