BDBM330485 US9725442, Compound I-284
SMILES CCOc1ccc(cc1)S(=O)(=O)N1C[C@@H](C)[C@H](C1)n1nc(C(C)C(O)=O)c2ccccc12
InChI Key InChIKey=WAHXZEXJKVTMPO-RWPZGMTISA-N
Data  2 KI
  Tab Delimited (TSV)   2D SDfile   Computed 3D by Vconf -m prep SDfile
Find this compound or compounds like it in BindingDB:
Activity Spreadsheet -- Enzyme Inhibition Constant Data from BindingDB
Found 2 hits for monomerid = 330485
TargetProstaglandin D2 receptor 2(Homo sapiens (Human))
Shionogi
US Patent
LigandPNGBDBM330485(US9725442, Compound I-284)
Affinity DataKi:  55nM. Assay description: Cell membrane was prepared from CRTH2-expressing K562 cell. The cell membrane (20 μg/well) was mixed with reaction buffer (50 mM Tris/HCl, pH 7....
Ligand InfoPC cidPC sid
In DepthDetails US Patent
TargetProstaglandin D2 receptor 2(Homo sapiens (Human))
Shionogi
US Patent
LigandPNGBDBM330485(US9725442, Compound I-284)
Affinity DataKi: <100nM. Assay description: Cell membrane was prepared from CRTH2-expressing K562 cell. The cell membrane (20 μg/well) was mixed with reaction buffer (50 mM Tris/HCl, pH 7....
Ligand InfoPC cidPC sid
In DepthDetails US Patent