BDBM330878 US9725445, 3-59
SMILES O=c1[nH]ccc2n(nc(Nc3ccc4c(CCS4(=O)=O)c3)c12)[C@H]1CCCC[C@@H]1C#N
InChI Key
Data  2 IC50
  Tab Delimited (TSV)   2D SDfile   Computed 3D by Vconf -m prep SDfile
Find this compound or compounds like it in BindingDB:
Activity Spreadsheet -- Enzyme Inhibition Constant Data from BindingDB
Found 2 hits for monomerid = 330878
TargetTyrosine-protein kinase JAK2(Homo sapiens (Human))
Merck Sharp & Dohme
US Patent
LigandPNGBDBM330878(US9725445, 3-59)
Affinity DataIC50:  710nM. Assay description: The ability of compounds to inhibit the activity of JAK1, JAK2, JAK3, and Tyk2 was measured using a recombinant purified GST-tagged catalytic domain ...
Ligand InfoPC cidPC sid
In DepthDetails US Patent
TargetTyrosine-protein kinase JAK1(Homo sapiens (Human))
Merck Sharp & Dohme
US Patent
LigandPNGBDBM330878(US9725445, 3-59)
Affinity DataIC50:  62nM. Assay description: The ability of compounds to inhibit the activity of JAK1, JAK2, JAK3, and Tyk2 was measured using a recombinant purified GST-tagged catalytic domain ...
Ligand InfoPC cidPC sid
In DepthDetails US Patent