BDBM33104 (E)-3-[5-(2-nitrophenyl)-2-furanyl]-1-phenyl-2-propen-1-one::(E)-3-[5-(2-nitrophenyl)-2-furyl]-1-phenyl-prop-2-en-1-one::(E)-3-[5-(2-nitrophenyl)furan-2-yl]-1-phenyl-prop-2-en-1-one::(E)-3-[5-(2-nitrophenyl)furan-2-yl]-1-phenylprop-2-en-1-one::3-[5-(2-Nitro-phenyl)-furan-2-yl]-1-phenyl-propenone::MLS000553332::SMR000175498::cid_5334380
SMILES [O-][N+](=O)c1ccccc1-c1ccc(\C=C\C(=O)c2ccccc2)o1
InChI Key InChIKey=QGXPDOSREJVCFW-ZRDIBKRKSA-N
Data  2 IC50  2 EC50
  Tab Delimited (TSV)   2D SDfile   Computed 3D by Vconf -m prep SDfile
Find this compound or compounds like it in BindingDB:
Activity Spreadsheet -- Enzyme Inhibition Constant Data from BindingDB
Found 4 hits for monomerid = 33104
TargetBcl-2-related protein A1(Homo sapiens (Human))
Nmmlsc
Curated by PubChem BioAssay
LigandPNGBDBM33104((E)-3-[5-(2-nitrophenyl)-2-furanyl]-1-phenyl-2-pro...)
Affinity DataEC50:  2.61E+3nMpH: 7.4 T: 2°C. Assay description: The multiplex is constructed by using beads for each protein target that have been labeled with varying intensities of red color, so that each assay ...
In DepthDetails PCBioAssay
TargetMethylosome protein 50/Protein arginine N-methyltransferase 5(Homo sapiens (Human))
Shandong University
Curated by ChEMBL
LigandPNGBDBM33104((E)-3-[5-(2-nitrophenyl)-2-furanyl]-1-phenyl-2-pro...)
Affinity DataIC50:  2.30E+4nM. Assay description: Inhibition of recombinant human N-terminal FLAG-tagged PRMT5 (2 to end residues) /human N-terminal His-tagged MEP50 (2 to end residues) expressed in ...
In DepthDetails ArticlePubMed
TargetMethylosome protein 50/Protein arginine N-methyltransferase 5(Homo sapiens (Human))
Shandong University
Curated by ChEMBL
LigandPNGBDBM33104((E)-3-[5-(2-nitrophenyl)-2-furanyl]-1-phenyl-2-pro...)
Affinity DataIC50:  1.69E+5nM. Assay description: Inhibition of recombinant human N-terminal FLAG-tagged PRMT5 (2 to end residues)/human N-terminal His-tagged MEP50 (2 to end residues) expressed in H...
In DepthDetails ArticlePubMed
TargetBcl-2-like protein 2(Homo sapiens (Human))
Nmmlsc
Curated by PubChem BioAssay
LigandPNGBDBM33104((E)-3-[5-(2-nitrophenyl)-2-furanyl]-1-phenyl-2-pro...)
Affinity DataEC50:  2.12E+4nM. Assay description: University of New Mexico Assay Overview: Assay Support: NIH 1X01 MH079850-01 HTS to identify small molecule regulators of Bcl-2 family protein int...
In DepthDetails PCBioAssay