BDBM331165 5-(1H-pyrrolo[2,3-b]pyridin-3-yl)-2,6-naphthyridin-1-ylamine::US9725446, Compound A32
SMILES Nc1nccc2c(nccc12)-c1c[nH]c2ncccc12
InChI Key InChIKey=JIVWSXGBUAROKH-UHFFFAOYSA-N
Data  1 IC50
  Tab Delimited (TSV)   2D SDfile   Computed 3D by Vconf -m prep SDfile
Find this compound or compounds like it in BindingDB:
Activity Spreadsheet -- Enzyme Inhibition Constant Data from BindingDB
Found 1 hit for monomerid = 331165
TargetTGF-beta receptor type-1(Homo sapiens (Human))
Merck Patent
US Patent
LigandPNGBDBM331165(5-(1H-pyrrolo[2,3-b]pyridin-3-yl)-2,6-naphthyridin...)
Affinity DataIC50: <1.00E+3nM. Assay description: In-Vitro (Enzyme) Assay for Determination of the Efficacy of the Inhibitors of the Inhibition of TGF-Beta-Mediated EffectsAs an example, the ability ...
Ligand InfoPC cidPC sid
In DepthDetails US Patent