BDBM331620 N-((S)-2-((3aS,6S,6aS)-6-chloro-3- oxotetrahydro-2H-furo[3,2-b]pyrrol-4(5H)-yl)- 1-cyclohexyl-2-oxoethyl)-5-(6-ethylpyridazin- 4-yl)thiophene-2-carboxamide::US9725459, 85
SMILES CCc1cc(cnn1)-c1ccc(s1)C(=O)N[C@@H](C1CCCCC1)C(=O)N1C[C@H](Cl)[C@H]2OCC(=O)[C@@H]12
InChI Key InChIKey=IJVAYUWTLKHHKT-AIZKBTNYSA-N
Data  2 KI
  Tab Delimited (TSV)   2D SDfile   Computed 3D by Vconf -m prep SDfile
Find this compound or compounds like it in BindingDB:
Activity Spreadsheet -- Enzyme Inhibition Constant Data from BindingDB
Found 2 hits for monomerid = 331620
TargetCathepsin K(Homo sapiens (Human))
Grunenthal
US Patent
LigandPNGBDBM331620(N-((S)-2-((3aS,6S,6aS)-6-chloro-3- oxotetrahydro-2...)
Affinity DataKi:  5nM. Assay description: Recombinant human cathepsins (CatS, CatK, CatL) were purchased from a Enzo Life Sciences. All assays were carried out in 96-well format using a buffe...
Ligand InfoPC cidPC sid
In DepthDetails US Patent
TargetCathepsin S(Homo sapiens (Human))
Grunenthal
US Patent
LigandPNGBDBM331620(N-((S)-2-((3aS,6S,6aS)-6-chloro-3- oxotetrahydro-2...)
Affinity DataKi:  6nM. Assay description: Recombinant human cathepsins (CatS, CatK, CatL) were purchased from a Enzo Life Sciences. All assays were carried out in 96-well format using a buffe...
Ligand InfoPC cidPC sid
In DepthDetails US Patent