BDBM331926 (2S)-1-{4-[5-Amino-6-(2,3-dichlorophenyl)-1,2,4-triazin-3-yl]piperazin-1-yl}-3-(cyclopropylmethoxy)propan-2-ol::US10189859, Compound 83
SMILES Nc1nc(nnc1-c1cccc(Cl)c1Cl)N1CCN(C[C@H](O)COCC2CC2)CC1
InChI Key InChIKey=ZGRHFAVCIIJSEJ-AWEZNQCLSA-N
Data  2 IC50
  Tab Delimited (TSV)   2D SDfile   Computed 3D by Vconf -m prep SDfile
Find this compound or compounds like it in BindingDB:
Activity Spreadsheet -- Enzyme Inhibition Constant Data from BindingDB
Found 2 hits for monomerid = 331926
TargetSodium channel protein type 9 subunit alpha(Homo sapiens (Human))
Nektar Therapeutics
US Patent
LigandPNGBDBM331926((2S)-1-{4-[5-Amino-6-(2,3-dichlorophenyl)-1,2,4-tr...)
Affinity DataIC50: <5.00E+4nM. Assay description: The potencies of the compounds provided herein to block specific Na+ channels was measured using automated patch clamp electrophysiologically of Nav1...
Ligand InfoPC cidPC sid
In DepthDetails US Patent
TargetSodium channel protein type 9 subunit alpha(Homo sapiens (Human))
Nektar Therapeutics
US Patent
LigandPNGBDBM331926((2S)-1-{4-[5-Amino-6-(2,3-dichlorophenyl)-1,2,4-tr...)
Affinity DataIC50:  1.71E+5nM. Assay description: The potencies of the compounds provided herein to block specific Na+ channels was measured using automated patch clamp electrophysiologically of Nav1...
Ligand InfoPC cidPC sid
In DepthDetails US Patent