BDBM331966 5-Bromo-N-(3-methyl-4,5,6,7-tetrahydro-benzo [b]thiophen-2yl)-phthalamic acid::US10195186, Example 6
SMILES OC(=O)c1cc(Br)ccc1C(=O)Nc1sc2CCCCc2c1[N+]#[C-]
InChI Key InChIKey=SEDQVISLONCNSI-UHFFFAOYSA-N
Data  1 IC50
  Tab Delimited (TSV)   2D SDfile   Computed 3D by Vconf -m prep SDfile
Find this compound or compounds like it in BindingDB:
Activity Spreadsheet -- Enzyme Inhibition Constant Data from BindingDB
Found 1 hit for monomerid = 331966
TargetSortilin(Homo sapiens (Human))
H. Lundbeck
US Patent
LigandPNGBDBM331966(5-Bromo-N-(3-methyl-4,5,6,7-tetrahydro-benzo [b]th...)
Affinity DataIC50:  4.00E+3nM. Assay description: The Sortilin assay was performed in total volume of 40 ul in 50 mM HEPES pH 7.4 assay buffer containing 100 mM NaCl, 2.0 mM CaCl2, 0.1% BSA and 0.1% ...
Ligand InfoPC cidPC sid
In DepthDetails US Patent