BDBM331969 US10195201, Example 8
SMILES CC(c1cnc(o1)-c1cc(=O)[nH]c(C)n1)c1ccc(cc1)C(F)(F)F
InChI Key
Data  2 KI
  Tab Delimited (TSV)   2D SDfile   Computed 3D by Vconf -m prep SDfile
Find this compound or compounds like it in BindingDB:
Activity Spreadsheet -- Enzyme Inhibition Constant Data from BindingDB
Found 2 hits for monomerid = 331969
TargetPhosphodiesterase(Macaca mulatta (Rhesus macaque))
Merck Sharp & Dohme
US Patent
LigandPNGBDBM331969(US10195201, Example 8)
Affinity DataKi:  352nM. Assay description: The activity of the compounds in accordance with the present invention as PDE2 inhibitors may be readily determined using a fluorescence polarization...
Ligand InfoPC cidPC sid
In DepthDetails US Patent
TargetcGMP-dependent 3',5'-cyclic phosphodiesterase(Homo sapiens (Human))
Merck Sharp & Dohme
US Patent
LigandPNGBDBM331969(US10195201, Example 8)
Affinity DataKi:  403nM. Assay description: The activity of the compounds in accordance with the present invention as PDE2 inhibitors may be readily determined using a fluorescence polarization...
Ligand InfoPC cidPC sid
In DepthDetails US Patent