BDBM331970 US10195201, Example 10::US10195201, Example 9
SMILES C[C@H](c1nnc(o1)-c1cc(=O)[nH]c(C)n1)c1ccc(cc1)C(F)(F)F
InChI Key
Data  5 KI
  Tab Delimited (TSV)   2D SDfile   Computed 3D by Vconf -m prep SDfile
Find this compound or compounds like it in BindingDB:
Activity Spreadsheet -- Enzyme Inhibition Constant Data from BindingDB
Found 5 hits for monomerid = 331970
TargetcGMP-dependent 3',5'-cyclic phosphodiesterase(Homo sapiens (Human))
Merck Sharp & Dohme
US Patent
LigandPNGBDBM331970(US10195201, Example 10 | US10195201, Example 9)
Affinity DataKi:  79nM. Assay description: The activity of the compounds in accordance with the present invention as PDE2 inhibitors may be readily determined using a fluorescence polarization...
Ligand InfoPC cidPC sid
In DepthDetails US Patent
TargetPhosphodiesterase(Macaca mulatta (Rhesus macaque))
Merck Sharp & Dohme
US Patent
LigandPNGBDBM331970(US10195201, Example 10 | US10195201, Example 9)
Affinity DataKi:  86nM. Assay description: The activity of the compounds in accordance with the present invention as PDE2 inhibitors may be readily determined using a fluorescence polarization...
Ligand InfoPC cidPC sid
In DepthDetails US Patent
TargetPhosphodiesterase(Macaca mulatta (Rhesus macaque))
Merck Sharp & Dohme
US Patent
LigandPNGBDBM331970(US10195201, Example 10 | US10195201, Example 9)
Affinity DataKi:  159nM. Assay description: The activity of the compounds in accordance with the present invention as PDE2 inhibitors may be readily determined using a fluorescence polarization...
Ligand InfoPC cidPC sid
In DepthDetails US Patent
TargetPhosphodiesterase(Macaca mulatta (Rhesus macaque))
Merck Sharp & Dohme
US Patent
LigandPNGBDBM331970(US10195201, Example 10 | US10195201, Example 9)
Affinity DataKi:  470nM. Assay description: The activity of the compounds in accordance with the present invention as PDE2 inhibitors may be readily determined using a fluorescence polarization...
Ligand InfoPC cidPC sid
In DepthDetails US Patent
TargetPhosphodiesterase(Macaca mulatta (Rhesus macaque))
Merck Sharp & Dohme
US Patent
LigandPNGBDBM331970(US10195201, Example 10 | US10195201, Example 9)
Affinity DataKi:  699nM. Assay description: The activity of the compounds in accordance with the present invention as PDE2 inhibitors may be readily determined using a fluorescence polarization...
Ligand InfoPC cidPC sid
In DepthDetails US Patent