BDBM332050 (E)-N'-(3-ethoxy-2- hydroxybenzal)-2-{N-{2-[N- (4-tert-butylbenzyl)-N- methylamino]ethyl}N- methylamino}acethydrazide::US10196346, Example 32
SMILES CCOc1cccc(\C=N\NC(=O)CN(C)CCN(C)Cc2ccc(cc2)C(C)(C)C)c1O
InChI Key InChIKey=RZXURABCTHRWHQ-WPWMEQJKSA-N
Data  1 EC50
  Tab Delimited (TSV)   2D SDfile   Computed 3D by Vconf -m prep SDfile
Find this compound or compounds like it in BindingDB:
Activity Spreadsheet -- Enzyme Inhibition Constant Data from BindingDB
Found 1 hit for monomerid = 332050
TargetHypoxia-inducible factor 1-alpha(Homo sapiens (Human))
Institute Of Pharmacology And Toxicology Academy Of Military Medical Sciences P.L.A. China
US Patent
LigandPNGBDBM332050((E)-N'-(3-ethoxy-2- hydroxybenzal)-2-{N-{2-[N- (4-...)
Affinity DataEC50:  1.86E+3nM. Assay description: The compounds were formulated with DMSO to form 30 mM stock solutions, and then formulated with analytical nutrient solution to form 2× working solut...
Ligand InfoPC cidPC sid
In DepthDetails US Patent