BDBM332147 US10189854, Compound 103::[1-[5-(2-Fluorophenyl)-pyrimidin-2-yl]-spiro[1,2-dihydro-indole-3,1'-cyclopropane]-6-yl]-(3-methyl-morpholin-4-yl)-methanone
SMILES CC1COCCN1C(=O)c1ccc2c(c1)N(CC21CC1)c1ncc(cn1)-c1ccccc1F
InChI Key InChIKey=RTCBEOJIEVNFNR-UHFFFAOYSA-N
Data  1 IC50
  Tab Delimited (TSV)   2D SDfile   Computed 3D by Vconf -m prep SDfile
Find this compound or compounds like it in BindingDB:
Activity Spreadsheet -- Enzyme Inhibition Constant Data from BindingDB
Found 1 hit for monomerid = 332147
TargetcAMP-specific 3',5'-cyclic phosphodiesterase 4B(Homo sapiens (Human))
Gruenenthal
US Patent
LigandPNGBDBM332147(US10189854, Compound 103 | [1-[5-(2-Fluorophenyl)-...)
Affinity DataIC50: <100nM. Assay description: The inhibiting effect of the compounds on the enzyme activity of human PDE4B1 was measured by the quantification of 5′-adenosine monophosphate ...
Ligand InfoPC cidPC sid
In DepthDetails US Patent