BDBM33233 thieno[2,3-d]pyrimidine, 21e
SMILES CCNC(=O)c1cc2c(nc(N)nc2s1)-c1ccc(Cl)cc1Cl
InChI Key InChIKey=YPEOXUOUTBMBCX-UHFFFAOYSA-N
Data  1 IC50
PDB links: 1 PDB ID matches this monomer.
  Tab Delimited (TSV)   2D SDfile   Computed 3D by Vconf -m prep SDfile
Find this compound or compounds like it in BindingDB:
Activity Spreadsheet -- Enzyme Inhibition Constant Data from BindingDB
Found 1 hit for monomerid = 33233
TargetHeat shock protein HSP 90-beta(Homo sapiens (Human))
Vernalis (R&D)
LigandPNGBDBM33233(thieno[2,3-d]pyrimidine, 21e)
Affinity DataIC50:  230nMpH: 7.4 T: 2°C. Assay description: The assay is based upon displacement of a fluorescently labeled molecule, which binds specifically to the ATP-binding site of full-length human Hsp90...