BDBM332339 US10189854, Compound 303
SMILES CN(C)C(=O)c1ccc2c(c1)N(CC21CC1)c1ncc(cn1)-c1cccc(C)n1
InChI Key InChIKey=PTGCZGHZJPANOH-UHFFFAOYSA-N
Data  1 IC50
  Tab Delimited (TSV)   2D SDfile   Computed 3D by Vconf -m prep SDfile
Find this compound or compounds like it in BindingDB:
Activity Spreadsheet -- Enzyme Inhibition Constant Data from BindingDB
Found 1 hit for monomerid = 332339
TargetcAMP-specific 3',5'-cyclic phosphodiesterase 4B(Homo sapiens (Human))
Gruenenthal
US Patent
LigandPNGBDBM332339(US10189854, Compound 303)
Affinity DataIC50: <100nM. Assay description: The inhibiting effect of the compounds on the enzyme activity of human PDE4B1 was measured by the quantification of 5′-adenosine monophosphate ...
Ligand InfoPC cidPC sid
In DepthDetails US Patent