BDBM332401 US10196353, Example 12::US11299457, Example 12
SMILES CCCc1cc2c(c(ccc2n1CC(C)(C)O)C#N)C(F)(F)F
InChI Key InChIKey=UBRFDZVHGGUVEL-UHFFFAOYSA-N
Data  2 IC50
  Tab Delimited (TSV)   2D SDfile   Computed 3D by Vconf -m prep SDfile
Find this compound or compounds like it in BindingDB:
Activity Spreadsheet -- Enzyme Inhibition Constant Data from BindingDB
Found 2 hits for monomerid = 332401
TargetAndrogen receptor(Homo sapiens (Human))
Glaxosmithkline Intellectual Property (No. 2)
US Patent
LigandPNGBDBM332401(US10196353, Example 12 | US11299457, Example 12)
Affinity DataIC50:  251nM. Assay description: The androgen receptor fluorescence polarization assay is used to investigate the interaction of the compounds with the androgen receptor.Compounds ar...
Ligand InfoPC cidPC sid
In DepthDetails US Patent
TargetProgesterone receptor(Homo sapiens (Human))
Glaxosmithkline
US Patent
LigandPNGBDBM332401(US10196353, Example 12 | US11299457, Example 12)
Affinity DataIC50:  251nM. Assay description: Compounds are added to the 384 well black low-volume plates to a final volume of 0.1 μL. DTT and DMSO are added to the chilled assay buffer just...
Ligand InfoPC cidPC sid
In DepthDetails US Patent