BDBM332470 4-(1-(2-chloro- 6- (trifluoromethyl) benzoyl)-6-(5- methyloxazol- 2-yl)-1H- indazol-3-yl)-3- fluorobenzoic acid::US10196354, Example 9B::US9745265, 9B
SMILES Cc1cnc(o1)-c1ccc2c(nn(C(=O)c3c(Cl)cccc3C(F)(F)F)c2c1)-c1ccc(cc1F)C(O)=O
InChI Key InChIKey=SQPYZFSEMVSKBI-UHFFFAOYSA-N
Data  2 IC50
  Tab Delimited (TSV)   2D SDfile   Computed 3D by Vconf -m prep SDfile
Find this compound or compounds like it in BindingDB:
Activity Spreadsheet -- Enzyme Inhibition Constant Data from BindingDB
Found 2 hits for monomerid = 332470
TargetNuclear receptor ROR-gamma(Mus musculus)
Merck Sharp & Dohme
US Patent
LigandPNGBDBM332470(4-(1-(2-chloro- 6- (trifluoromethyl) benzoyl)-6-(5...)
Affinity DataIC50:  14nM. Assay description: To identify novel antagonists of RORgammaT, an assay was developed which employs the interaction of RORgammaT with its co-activator peptide SRC1_2. T...
Ligand InfoPC cidPC sid
In DepthDetails US Patent
TargetNuclear receptor ROR-gamma(Homo sapiens (Human))
Merck Sharp & Dohme
US Patent
LigandPNGBDBM332470(4-(1-(2-chloro- 6- (trifluoromethyl) benzoyl)-6-(5...)
Affinity DataIC50:  14nM. Assay description: The compounds of the invention inhibit RORgammaT activity. Activation of RORgammaT activity can be measured using, e.g., biochemical TR-FRET assay. I...
Ligand InfoPC cidPC sid
In DepthDetails US Patent