BDBM332521 4-(1-(2-chloro-6-(trifluoromethyl)benzoyl)-6-(1,3-oxazinane-3-carbonyl)-1H-pyrazolo[4,3-b]pyridin-3-yl)-3-fluorobenzoic acid::US10196354, Example 35A::US9745265, 35A
SMILES OC(=O)c1ccc(-c2nn(C(=O)c3c(Cl)cccc3C(F)(F)F)c3cc(cnc23)C(=O)N2CCCOC2)c(F)c1
InChI Key InChIKey=VWLWIRYLQWWKSU-UHFFFAOYSA-N
Data  2 IC50
  Tab Delimited (TSV)   2D SDfile   Computed 3D by Vconf -m prep SDfile
Find this compound or compounds like it in BindingDB:
Activity Spreadsheet -- Enzyme Inhibition Constant Data from BindingDB
Found 2 hits for monomerid = 332521
TargetNuclear receptor ROR-gamma(Mus musculus)
Merck Sharp & Dohme
US Patent
LigandPNGBDBM332521(4-(1-(2-chloro-6-(trifluoromethyl)benzoyl)-6-(1,3-...)
Affinity DataIC50:  11nM. Assay description: To identify novel antagonists of RORgammaT, an assay was developed which employs the interaction of RORgammaT with its co-activator peptide SRC1_2. T...
Ligand InfoPC cidPC sid
In DepthDetails US Patent
TargetNuclear receptor ROR-gamma(Homo sapiens (Human))
Merck Sharp & Dohme
US Patent
LigandPNGBDBM332521(4-(1-(2-chloro-6-(trifluoromethyl)benzoyl)-6-(1,3-...)
Affinity DataIC50:  11nM. Assay description: The compounds of the invention inhibit RORgammaT activity. Activation of RORgammaT activity can be measured using, e.g., biochemical TR-FRET assay. I...
Ligand InfoPC cidPC sid
In DepthDetails US Patent