BDBM332663 US10196373, Compound 27LB
SMILES CN(CC(=O)N(Cc1ccc(cc1)-c1cccc(c1)C#N)c1ccc(C(O)=O)c(O)c1)S(=O)(=O)c1ccc(C)cc1
InChI Key InChIKey=FVNXGHXLFLLWBG-UHFFFAOYSA-N
Data  1 IC50
  Tab Delimited (TSV)   2D SDfile   Computed 3D by Vconf -m prep SDfile
Find this compound or compounds like it in BindingDB:
Activity Spreadsheet -- Enzyme Inhibition Constant Data from BindingDB
Found 1 hit for monomerid = 332663
TargetSignal transducer and activator of transcription 3(Homo sapiens (Human))
The Governing Council Of The University Of Toronto
US Patent
LigandPNGBDBM332663(US10196373, Compound 27LB)
Affinity DataIC50:  2.50E+5nM. Assay description: ChIP assay was performed using EZ ChIP Kit (Millipore, Billerica, Mass., USA) as per manufacturer's instruction. Briefly, after crosslinking with...
Ligand InfoPC cidPC sid
In DepthDetails US Patent