BDBM332685 US10196374, Example 13
SMILES CC(C)[C@H](NC(=O)C(F)(F)F)[C@H](Oc1ccc2n(ncc2c1)-c1ccc(=O)n(C)c1)c1ccc(Cl)cc1
InChI Key InChIKey=VGWREYOKZOTPSL-BJKOFHAPSA-N
Data  1 IC50  1 EC50
  Tab Delimited (TSV)   2D SDfile   Computed 3D by Vconf -m prep SDfile
Find this compound or compounds like it in BindingDB:
Activity Spreadsheet -- Enzyme Inhibition Constant Data from BindingDB
Found 2 hits for monomerid = 332685
TargetGlucocorticoid receptor(Homo sapiens (Human))
Astrazeneca
US Patent
LigandPNGBDBM332685(US10196374, Example 13)
Affinity DataIC50:  126nM. Assay description: A reporter cell line (ChagoK1 18:7:2 s4/GRE) was established by stable transfection of the human bronchogenic carcinoma celline, ChaGo K1 (ATCC: HTB ...
Ligand InfoPC cidPC sid
In DepthDetails US Patent
TargetGlucocorticoid receptor(Homo sapiens (Human))
Astrazeneca
US Patent
LigandPNGBDBM332685(US10196374, Example 13)
Affinity DataEC50:  5.01nM. Assay description: A reporter cell line (ChagoK1 18:7:2 s4/GRE) was established by stable transfection of the human bronchogenic carcinoma cell line, ChaGo K1 (ATCC: HT...
Ligand InfoPC cidPC sid
In DepthDetails US Patent