BDBM332712 2-(4-(5-methoxypyrimidin-2-yl)piperazin-1-yl)-1H-benzimidazole-4-carboxamide::US10196381, Compound (5)
SMILES COc1cnc(nc1)N1CCN(CC1)c1nc2c(cccc2[nH]1)C(N)=O
InChI Key InChIKey=FYQPAHBPAZJMBU-UHFFFAOYSA-N
Data  1 IC50
  Tab Delimited (TSV)   2D SDfile   Computed 3D by Vconf -m prep SDfile
Find this compound or compounds like it in BindingDB:
Activity Spreadsheet -- Enzyme Inhibition Constant Data from BindingDB
Found 1 hit for monomerid = 332712
TargetPoly [ADP-ribose] polymerase 1(Homo sapiens (Human))
Shanghai Huilun Life Science & Technology
US Patent
LigandPNGBDBM332712(2-(4-(5-methoxypyrimidin-2-yl)piperazin-1-yl)-1H-b...)
Affinity DataIC50:  74nM. Assay description: 1. 50 μl of 1×PARP buffer per well was added to infiltrate the histone, and the plate was incubated for 30 min at room temperature. Then the 1×P...
Ligand InfoPC cidPC sid
In DepthDetails US Patent