BDBM332894 US10196390, Compound I-183
SMILES COc1ccc(Nc2nc(nc3CNC(=O)c23)N2[C@@H](C)CCC[C@H]2C)cc1
InChI Key InChIKey=MHJNAXVJIAZYMO-BETUJISGSA-N
Data  2 KI
  Tab Delimited (TSV)   2D SDfile   Computed 3D by Vconf -m prep SDfile
Find this compound or compounds like it in BindingDB:
Activity Spreadsheet -- Enzyme Inhibition Constant Data from BindingDB
Found 2 hits for monomerid = 332894
TargetNon-receptor tyrosine-protein kinase TYK2(Homo sapiens (Human))
Nimbus Lakshmi
US Patent
LigandPNGBDBM332894(US10196390, Compound I-183)
Affinity DataKi: <10nM. Assay description: The caliper machine employs an off chip mobility shift assay to detect phosphorylated peptide substrates from kinase assays, using microfluidics tech...
Ligand InfoPC cidPC sid
In DepthDetails US Patent
TargetTyrosine-protein kinase JAK2(Homo sapiens (Human))
Nimbus Lakshmi
US Patent
LigandPNGBDBM332894(US10196390, Compound I-183)
Affinity DataKi:  55nM
Ligand InfoPC cidPC sid
In DepthDetails US Patent