BDBM332995 US10196390, Compound I-284
SMILES CC1(C)CCCC(=O)N1c1ccc(Nc2cc(nc3CNC(=O)c23)-c2c(F)cccc2F)nc1
InChI Key InChIKey=SBISSVYIZZWLPI-UHFFFAOYSA-N
Data  2 KI
  Tab Delimited (TSV)   2D SDfile   Computed 3D by Vconf -m prep SDfile
Find this compound or compounds like it in BindingDB:
Activity Spreadsheet -- Enzyme Inhibition Constant Data from BindingDB
Found 2 hits for monomerid = 332995
TargetNon-receptor tyrosine-protein kinase TYK2(Homo sapiens (Human))
Nimbus Lakshmi
US Patent
LigandPNGBDBM332995(US10196390, Compound I-284)
Affinity DataKi: <10nM. Assay description: The caliper machine employs an off chip mobility shift assay to detect phosphorylated peptide substrates from kinase assays, using microfluidics tech...
Ligand InfoPC cidPC sid
In DepthDetails US Patent
TargetTyrosine-protein kinase JAK2(Homo sapiens (Human))
Nimbus Lakshmi
US Patent
LigandPNGBDBM332995(US10196390, Compound I-284)
Affinity DataKi:  55nM
Ligand InfoPC cidPC sid
In DepthDetails US Patent