BDBM333081 US10196391, Example 81
SMILES COc1nc(nc2CCN(Cc12)c1ccc(cc1)S(C)(=O)=O)-c1ccccn1
InChI Key InChIKey=YCKFQFPMHKXRPB-UHFFFAOYSA-N
Data  1 IC50
  Tab Delimited (TSV)   2D SDfile   Computed 3D by Vconf -m prep SDfile
Find this compound or compounds like it in BindingDB:
Activity Spreadsheet -- Enzyme Inhibition Constant Data from BindingDB
Found 1 hit for monomerid = 333081
TargetGenome polyprotein(Hepatitis GB virus B)
Hoffmann-La Roche
US Patent
LigandPNGBDBM333081(US10196391, Example 81)
Affinity DataIC50:  1.13E+4nM. Assay description: HepG2.2.15 cells were seeded in duplicate into white, 96-well plates at 1.5×104 cells/well. The cells were treated with a three-fold serial dilution ...
Ligand InfoPC cidPC sid
In DepthDetails US Patent