BDBM333190 US10196436, Compound 40
SMILES COc1cc(OC)c(Cl)c(c1Cl)-c1cc2cnc(Nc3ccccc3NC(=O)C=C)c(C)c2n(C)c1=O
InChI Key InChIKey=JNHOKTZMECHTRO-UHFFFAOYSA-N
Data  2 IC50
  Tab Delimited (TSV)   2D SDfile   Computed 3D by Vconf -m prep SDfile
Find this compound or compounds like it in BindingDB:
Activity Spreadsheet -- Enzyme Inhibition Constant Data from BindingDB
Found 2 hits for monomerid = 333190
TargetFibroblast growth factor receptor 1(Homo sapiens (Human))
Blueprint Medicines
US Patent
LigandPNGBDBM333190(US10196436, Compound 40)
Affinity DataIC50: >1.00E+3nM. Assay description: In each well of a 384-well plate, 0.1 ng/ul of wild type FGFR-1 (Carna Biosciences, Inc.) was incubated in a total of 12.5 ul of buffer (100 mM HEPES...
Ligand InfoPC cidPC sid
In DepthDetails US Patent
TargetFibroblast growth factor receptor 4(Homo sapiens (Human))
Blueprint Medicines
US Patent
LigandPNGBDBM333190(US10196436, Compound 40)
Affinity DataIC50:  550nM. Assay description: In each well of a 384-well plate, 0.5 ng/ul of wild type FGFR-4 (Carna Biosciences, Inc.) was incubated in a total of 12.5 ul of buffer (100 mM HEPES...
Ligand InfoPC cidPC sid
In DepthDetails US Patent