BDBM333387 2-(1-{[3-(1- Benzofuran-2- yl)imidazo[1,2-b]pyridazin- 6-yl]oxy}cyclopentyl)- N-methylethanamine::US9730929, Example 8
SMILES CN(CCC1(O)CCCC1)c1ccc2ncc(-c3cc4ccccc4o3)n2n1
InChI Key InChIKey=VTZIZPWNIRSLIW-UHFFFAOYSA-N
Data  1 IC50
  Tab Delimited (TSV)   2D SDfile   Computed 3D by Vconf -m prep SDfile
Find this compound or compounds like it in BindingDB:
Activity Spreadsheet -- Enzyme Inhibition Constant Data from BindingDB
Found 1 hit for monomerid = 333387
TargetMAP kinase-interacting serine/threonine-protein kinase 1(Homo sapiens (Human))
Bayer Intellectual Property
US Patent
LigandPNGBDBM333387(2-(1-{[3-(1- Benzofuran-2- yl)imidazo[1,2-b]pyrida...)
Affinity DataIC50:  45nM. Assay description: A recombinant fusion protein of Glutathione-S-Transferase (GST, N-terminally) and human full-length MKNK1 (amino acids 1-424 and T344D of accession n...
Ligand InfoPC cidPC sid
In DepthDetails US Patent