BDBM333388 3-[(1R)-1-Hydroxy-2- {[3-(4-methoxy-1- benzofuran-2- yl)imidazo[1,2-b]pyridazin- 6-yl](methyl)amino}eth- yl]phenol::US9730929, Example 9
SMILES COc1cccc2oc(cc12)-c1cnc2ccc(nn12)N(C)C[C@H](O)c1cccc(O)c1
InChI Key InChIKey=KJGPWXPBUDJVTJ-IBGZPJMESA-N
Data  1 IC50
  Tab Delimited (TSV)   2D SDfile   Computed 3D by Vconf -m prep SDfile
Find this compound or compounds like it in BindingDB:
Activity Spreadsheet -- Enzyme Inhibition Constant Data from BindingDB
Found 1 hit for monomerid = 333388
TargetMAP kinase-interacting serine/threonine-protein kinase 1(Homo sapiens (Human))
Bayer Intellectual Property
US Patent
LigandPNGBDBM333388(3-[(1R)-1-Hydroxy-2- {[3-(4-methoxy-1- benzofuran-...)
Affinity DataIC50:  4nM. Assay description: A recombinant fusion protein of Glutathione-S-Transferase (GST, N-terminally) and human full-length MKNK1 (amino acids 1-424 and T344D of accession n...
Ligand InfoPC cidPC sid
In DepthDetails US Patent