BDBM333434 US9737522, Compound 8
SMILES CC(=O)C1=C(O)C(=O)N(CCc2c[nH]c3ccccc23)C1c1ccc(C)cc1O
InChI Key
Data  1 IC50
  Tab Delimited (TSV)   2D SDfile   Computed 3D by Vconf -m prep SDfile
Find this compound or compounds like it in BindingDB:
Activity Spreadsheet -- Enzyme Inhibition Constant Data from BindingDB
Found 1 hit for monomerid = 333434
TargetNuclear receptor subfamily 2 group C member 1(Rattus norvegicus (Rat))
Emory University
US Patent
LigandPNGBDBM333434(US9737522, Compound 8)
Affinity DataIC50:  1.50E+4nM. Assay description: Two-electrode voltage-clamp recordings were made from Xenopus laevis oocytes expressing recombinant rat GluN1/GluN2A, GluN1/GluN2B, GluN1/GluN2C, Glu...
Ligand InfoPC cidPC sid
In DepthDetails US Patent