BDBM333455 US9737525, Compound MIND4-11
SMILES C(Oc1cccc2ccccc12)c1nnc(SCc2ccccc2)n1-c1ccccc1
InChI Key InChIKey=LEDFCRCFWZPAOY-UHFFFAOYSA-N
Data  2 IC50
  Tab Delimited (TSV)   2D SDfile   Computed 3D by Vconf -m prep SDfile
Find this compound or compounds like it in BindingDB:
Activity Spreadsheet -- Enzyme Inhibition Constant Data from BindingDB
Found 2 hits for monomerid = 333455
TargetNAD-dependent protein deacetylase sirtuin-2(Homo sapiens (Human))
The General Hospital
US Patent
LigandPNGBDBM333455(US9737525, Compound MIND4-11)
Affinity DataIC50:  4.50E+3nM. Assay description: Modulation of sirtuin activity by compounds was assessed using the Flour de Lys fluorescent biochemical assay in a 96-well format as described (Outei...
In DepthDetails US Patent
TargetNAD-dependent protein deacetylase sirtuin-2(Homo sapiens (Human))
The General Hospital
US Patent
LigandPNGBDBM333455(US9737525, Compound MIND4-11)
Affinity DataIC50:  4.50E+3nM. Assay description: Modulation of sirtuin activity by compounds was assessed using the Flour de Lys fluorescent biochemical assay in a 96-well format as described (Outei...
In DepthDetails US Patent