BDBM333482 1-(5-tert- butylisoxazol- 3-yl)-3-(3- (6-(3-(4- (hydroxy- methyl) piperidin-1- yl)propoxy)- 7- methoxy- quinazolin- 4-yloxy) phenyl) urea::US9730937, Example 24
SMILES COc1cc2ncnc(Oc3cccc(NC(=O)Nc4cc(on4)C(C)(C)C)c3)c2cc1OCCCN1CCC(CO)CC1
InChI Key InChIKey=VTKPGNXMBCMSNM-UHFFFAOYSA-N
Data  3 Kd
  Tab Delimited (TSV)   2D SDfile   Computed 3D by Vconf -m prep SDfile
Find this compound or compounds like it in BindingDB:
Activity Spreadsheet -- Enzyme Inhibition Constant Data from BindingDB
Found 3 hits for monomerid = 333482
TargetSerine/threonine-protein kinase B-raf [V600E](Homo sapiens (Human))
Ambit Biosciences
US Patent
LigandPNGBDBM333482(1-(5-tert- butylisoxazol- 3-yl)-3-(3- (6-(3-(4- (h...)
Affinity DataKd: <250nM. Assay description: Competition binding assays used herein were developed, validated and performed as described in Fabian et al., Nature Biotechnology 2005, 23, 329-336....
Ligand InfoPC cidPC sid
In DepthDetails US Patent
TargetRAF proto-oncogene serine/threonine-protein kinase(Homo sapiens (Human))
Ambit Biosciences
US Patent
LigandPNGBDBM333482(1-(5-tert- butylisoxazol- 3-yl)-3-(3- (6-(3-(4- (h...)
Affinity DataKd:  750nM. Assay description: Competition binding assays used herein were developed, validated and performed as described in Fabian et al., Nature Biotechnology 2005, 23, 329-336....
Ligand InfoPC cidPC sid
In DepthDetails US Patent
TargetSerine/threonine-protein kinase B-raf(Homo sapiens (Human))
Ambit Biosciences
US Patent
LigandPNGBDBM333482(1-(5-tert- butylisoxazol- 3-yl)-3-(3- (6-(3-(4- (h...)
Affinity DataKd:  750nM. Assay description: Competition binding assays used herein were developed, validated and performed as described in Fabian et al., Nature Biotechnology 2005, 23, 329-336....
Ligand InfoPC cidPC sid
In DepthDetails US Patent