BDBM333521 1-(5-tert- butyl- isoxazol-3- yl)-3-(3-{6- [3-(1,1- dioxo- thiomorpholin-4- yl)-propoxy]-7- methoxy- quinazolin-4- ylsulfanyl}- phenyl)-urea::US9730937, Example 62
SMILES COc1cc2ncnc(Sc3cccc(NC(=O)Nc4cc(on4)C(C)(C)C)c3)c2cc1OCCCN1CCS(=O)(=O)CC1
InChI Key InChIKey=DJYIRCKUXBIJIK-UHFFFAOYSA-N
Data  3 Kd
  Tab Delimited (TSV)   2D SDfile   Computed 3D by Vconf -m prep SDfile
Find this compound or compounds like it in BindingDB:
Activity Spreadsheet -- Enzyme Inhibition Constant Data from BindingDB
Found 3 hits for monomerid = 333521
TargetSerine/threonine-protein kinase B-raf [V600E](Homo sapiens (Human))
Ambit Biosciences
US Patent
LigandPNGBDBM333521(1-(5-tert- butyl- isoxazol-3- yl)-3-(3-{6- [3-(1,1...)
Affinity DataKd: <250nM. Assay description: Competition binding assays used herein were developed, validated and performed as described in Fabian et al., Nature Biotechnology 2005, 23, 329-336....
Ligand InfoPC cidPC sid
In DepthDetails US Patent
TargetRAF proto-oncogene serine/threonine-protein kinase(Homo sapiens (Human))
Ambit Biosciences
US Patent
LigandPNGBDBM333521(1-(5-tert- butyl- isoxazol-3- yl)-3-(3-{6- [3-(1,1...)
Affinity DataKd: <250nM. Assay description: Competition binding assays used herein were developed, validated and performed as described in Fabian et al., Nature Biotechnology 2005, 23, 329-336....
Ligand InfoPC cidPC sid
In DepthDetails US Patent
TargetSerine/threonine-protein kinase B-raf(Homo sapiens (Human))
Ambit Biosciences
US Patent
LigandPNGBDBM333521(1-(5-tert- butyl- isoxazol-3- yl)-3-(3-{6- [3-(1,1...)
Affinity DataKd:  375nM. Assay description: Competition binding assays used herein were developed, validated and performed as described in Fabian et al., Nature Biotechnology 2005, 23, 329-336....
Ligand InfoPC cidPC sid
In DepthDetails US Patent