BDBM333592 1-(3-chloro- 5- (trifluoromethyl) phenyl)- 3-(2-(6,7- dimethoxy- quinazolin- 4- yloxy)phenyl) urea::US9730937, Example 140
SMILES COc1cc2ncnc(Oc3cccc(NC(=O)Nc4cc(Cl)cc(c4)C(F)(F)F)c3)c2cc1OC
InChI Key InChIKey=RROQWAQPZPDXHB-UHFFFAOYSA-N
Data  3 Kd
  Tab Delimited (TSV)   2D SDfile   Computed 3D by Vconf -m prep SDfile
Find this compound or compounds like it in BindingDB:
Activity Spreadsheet -- Enzyme Inhibition Constant Data from BindingDB
Found 3 hits for monomerid = 333592
TargetSerine/threonine-protein kinase B-raf [V600E](Homo sapiens (Human))
Ambit Biosciences
US Patent
LigandPNGBDBM333592(1-(3-chloro- 5- (trifluoromethyl) phenyl)- 3-(2-(6...)
Affinity DataKd:  750nM. Assay description: Competition binding assays used herein were developed, validated and performed as described in Fabian et al., Nature Biotechnology 2005, 23, 329-336....
Ligand InfoPC cidPC sid
In DepthDetails US Patent
TargetRAF proto-oncogene serine/threonine-protein kinase(Homo sapiens (Human))
Ambit Biosciences
US Patent
LigandPNGBDBM333592(1-(3-chloro- 5- (trifluoromethyl) phenyl)- 3-(2-(6...)
Affinity DataKd:  750nM. Assay description: Competition binding assays used herein were developed, validated and performed as described in Fabian et al., Nature Biotechnology 2005, 23, 329-336....
Ligand InfoPC cidPC sid
In DepthDetails US Patent
TargetSerine/threonine-protein kinase B-raf(Homo sapiens (Human))
Ambit Biosciences
US Patent
LigandPNGBDBM333592(1-(3-chloro- 5- (trifluoromethyl) phenyl)- 3-(2-(6...)
Affinity DataKd: >1.00E+3nM. Assay description: Competition binding assays used herein were developed, validated and performed as described in Fabian et al., Nature Biotechnology 2005, 23, 329-336....
Ligand InfoPC cidPC sid
In DepthDetails US Patent