BDBM333783 1-(3-tert- butyl-1- isobutyl-1H- pyrazol-5-yl)- 3-(3- (6,7- dimethoxy- quinazolin- 4-ylthio) phenyl)urea::US9730937, Example 333
SMILES COc1cc2ncnc(Sc3cccc(NC(=O)Nc4cc(nn4CC(C)C)C(C)(C)C)c3)c2cc1OC
InChI Key InChIKey=UGGGYSTZAPTBNH-UHFFFAOYSA-N
Data  3 Kd
  Tab Delimited (TSV)   2D SDfile   Computed 3D by Vconf -m prep SDfile
Find this compound or compounds like it in BindingDB:
Activity Spreadsheet -- Enzyme Inhibition Constant Data from BindingDB
Found 3 hits for monomerid = 333783
TargetSerine/threonine-protein kinase B-raf [V600E](Homo sapiens (Human))
Ambit Biosciences
US Patent
LigandPNGBDBM333783(1-(3-tert- butyl-1- isobutyl-1H- pyrazol-5-yl)- 3-...)
Affinity DataKd: <250nM. Assay description: Competition binding assays used herein were developed, validated and performed as described in Fabian et al., Nature Biotechnology 2005, 23, 329-336....
Ligand InfoPC cidPC sid
In DepthDetails US Patent
TargetRAF proto-oncogene serine/threonine-protein kinase(Homo sapiens (Human))
Ambit Biosciences
US Patent
LigandPNGBDBM333783(1-(3-tert- butyl-1- isobutyl-1H- pyrazol-5-yl)- 3-...)
Affinity DataKd:  375nM. Assay description: Competition binding assays used herein were developed, validated and performed as described in Fabian et al., Nature Biotechnology 2005, 23, 329-336....
Ligand InfoPC cidPC sid
In DepthDetails US Patent
TargetSerine/threonine-protein kinase B-raf(Homo sapiens (Human))
Ambit Biosciences
US Patent
LigandPNGBDBM333783(1-(3-tert- butyl-1- isobutyl-1H- pyrazol-5-yl)- 3-...)
Affinity DataKd:  375nM. Assay description: Competition binding assays used herein were developed, validated and performed as described in Fabian et al., Nature Biotechnology 2005, 23, 329-336....
Ligand InfoPC cidPC sid
In DepthDetails US Patent