BDBM334153 4-[1-(4-Amino-5-methyl-7H-pyrrolo[2,3-d]pyrimidin-7-yl)ethyl]-6-chloro-3-ethoxy-2-(1-isopropylazetidin-3-yl)benzonitrile::US10646492, Example 307::US11433071, Example 307::US9730939, Example 307::US9932341, Example 307
SMILES CCOc1c(cc(Cl)c(C#N)c1C1CN(C1)C(C)C)C(C)n1cc(C)c2c(N)ncnc12
InChI Key InChIKey=PPURAVRTZVKOKD-UHFFFAOYSA-N
Data  4 IC50
  Tab Delimited (TSV)   2D SDfile   Computed 3D by Vconf -m prep SDfile
Find this compound or compounds like it in BindingDB:
Activity Spreadsheet -- Enzyme Inhibition Constant Data from BindingDB
Found 4 hits for monomerid = 334153
TargetPhosphatidylinositol 4,5-bisphosphate 3-kinase catalytic subunit delta isoform(Homo sapiens (Human))
Incyte Holdings
US Patent
LigandPNGBDBM334153(4-[1-(4-Amino-5-methyl-7H-pyrrolo[2,3-d]pyrimidin-...)
Affinity DataIC50: <10nM. Assay description: [γ-33P]ATP (10 mCi/mL) was purchased from PerkinElmer (Waltham, Mass.). Lipid kinase substrate, D-myo-Phosphatidylinositol 4,5-bisphosphate (Ptd...
Ligand InfoPC cidPC sid
In DepthDetails US Patent
TargetPhosphatidylinositol 4,5-bisphosphate 3-kinase catalytic subunit delta isoform(Homo sapiens (Human))
Incyte Holdings
US Patent
LigandPNGBDBM334153(4-[1-(4-Amino-5-methyl-7H-pyrrolo[2,3-d]pyrimidin-...)
Affinity DataIC50: <10nM. Assay description: The kinase reaction was conducted in polystyrene 384-well matrix white plate from Thermo Fisher Scientific in a final volume of 25 μL. Inhibitor...
Ligand InfoPC cidPC sid
In DepthDetails US Patent
TargetPhosphatidylinositol 4,5-bisphosphate 3-kinase catalytic subunit delta isoform(Homo sapiens (Human))
Incyte Holdings
US Patent
LigandPNGBDBM334153(4-[1-(4-Amino-5-methyl-7H-pyrrolo[2,3-d]pyrimidin-...)
Affinity DataIC50: <10nM. Assay description: The kinase reaction was conducted in polystyrene 384-well matrix white plate from Thermo Fisher Scientific in a final volume of 25 uL. Inhibitors wer...
Ligand InfoPC cidPC sid
In DepthDetails US Patent
TargetPhosphatidylinositol 4,5-bisphosphate 3-kinase catalytic subunit delta isoform(Homo sapiens (Human))
Incyte Holdings
US Patent
LigandPNGBDBM334153(4-[1-(4-Amino-5-methyl-7H-pyrrolo[2,3-d]pyrimidin-...)
Affinity DataIC50: <10nM. Assay description: The kinase reaction was conducted in polystyrene 384-well matrix white plate from Thermo Fisher Scientific in a final volume of 25 uL. Inhibitors wer...
Ligand InfoPC cidPC sid
In DepthDetails US Patent