BDBM334198 Diastereomers of 4-{3-[1-(4-amino-3-methyl-1H-pyrazolo[3,4-d]pyrimidin-1-yl)ethyl]-5-chloro-2-ethoxy-6-fluorophenyl}-1,3-oxazolidin-2-one::US9730939, Example 353::US9730939, Example 354::US9932341, Example 354
SMILES CCOc1c(cc(Cl)c(F)c1C1COC(=O)N1)C(C)n1nc(C)c2c(N)ncnc12
InChI Key InChIKey=UCYDWQYLQRHHCX-UHFFFAOYSA-N
Data  4 IC50
  Tab Delimited (TSV)   2D SDfile   Computed 3D by Vconf -m prep SDfile
Find this compound or compounds like it in BindingDB:
Activity Spreadsheet -- Enzyme Inhibition Constant Data from BindingDB
Found 4 hits for monomerid = 334198
TargetPhosphatidylinositol 4,5-bisphosphate 3-kinase catalytic subunit delta isoform(Homo sapiens (Human))
Incyte Holdings
US Patent
LigandPNGBDBM334198(Diastereomers of 4-{3-[1-(4-amino-3-methyl-1H-pyra...)
Affinity DataIC50: >500nM. Assay description: [γ-33P]ATP (10 mCi/mL) was purchased from PerkinElmer (Waltham, Mass.). Lipid kinase substrate, D-myo-Phosphatidylinositol 4,5-bisphosphate (Ptd...
Ligand InfoPC cidPC sid
In DepthDetails US Patent
TargetPhosphatidylinositol 4,5-bisphosphate 3-kinase catalytic subunit delta isoform(Homo sapiens (Human))
Incyte Holdings
US Patent
LigandPNGBDBM334198(Diastereomers of 4-{3-[1-(4-amino-3-methyl-1H-pyra...)
Affinity DataIC50: <10nM. Assay description: The kinase reaction was conducted in polystyrene 384-well matrix white plate from Thermo Fisher Scientific in a final volume of 25 uL. Inhibitors wer...
Ligand InfoPC cidPC sid
In DepthDetails US Patent
TargetPhosphatidylinositol 4,5-bisphosphate 3-kinase catalytic subunit delta isoform(Homo sapiens (Human))
Incyte Holdings
US Patent
LigandPNGBDBM334198(Diastereomers of 4-{3-[1-(4-amino-3-methyl-1H-pyra...)
Affinity DataIC50: >500nM. Assay description: The kinase reaction was conducted in polystyrene 384-well matrix white plate from Thermo Fisher Scientific in a final volume of 25 uL. Inhibitors wer...
Ligand InfoPC cidPC sid
In DepthDetails US Patent
TargetPhosphatidylinositol 4,5-bisphosphate 3-kinase catalytic subunit delta isoform(Homo sapiens (Human))
Incyte Holdings
US Patent
LigandPNGBDBM334198(Diastereomers of 4-{3-[1-(4-amino-3-methyl-1H-pyra...)
Affinity DataIC50: <10nM. Assay description: [γ-33P]ATP (10 mCi/mL) was purchased from PerkinElmer (Waltham, Mass.). Lipid kinase substrate, D-myo-Phosphatidylinositol 4,5-bisphosphate (Ptd...
Ligand InfoPC cidPC sid
In DepthDetails US Patent