BDBM334368 1-(3-(tert-Butyl)-1-(P-tolyl)-1H-pyrazol-5-yl)-3-(4-((2-((3-cyano-5-(2-(2-(2-methoxyethoxy)-ethoxy)ethoxy)phenyl)amino)pyrimidin-4-yl)oxy)naphthalen-1-yl)urea::US9732063, Example 52
SMILES COCCOCCOCCOc1cc(Nc2nccc(Oc3ccc(NC(=O)Nc4cc(nn4-c4ccc(C)cc4)C(C)(C)C)c4ccccc34)n2)cc(c1)C#N
InChI Key InChIKey=NFKMXTQDBCPJPP-UHFFFAOYSA-N
Data  1 IC50
  Tab Delimited (TSV)   2D SDfile   Computed 3D by Vconf -m prep SDfile
Find this compound or compounds like it in BindingDB:
Activity Spreadsheet -- Enzyme Inhibition Constant Data from BindingDB
Found 1 hit for monomerid = 334368
TargetGlycogen synthase kinase-3 alpha(Homo sapiens (Human))
Respivert
US Patent
LigandPNGBDBM334368(1-(3-(tert-Butyl)-1-(P-tolyl)-1H-pyrazol-5-yl)-3-(...)
Affinity DataIC50: >1.30E+4nM. Assay description: The inhibitory activities of compounds of the invention against the GSK 3α enzyme isoform (Invitrogen), are evaluated by determining the level o...
Ligand InfoPC cidPC sid
In DepthDetails US Patent