BDBM3350 CHEMBL342929::N,1-dimethyl-2-{[1-methyl-3-(methylcarbamoyl)-1H-indol-2-yl]disulfanyl}-1H-indole-3-carboxamide::dithiobis(1H-indoles) deriv. 3
SMILES CNC(=O)c1c(SSc2c(C(=O)NC)c3ccccc3n2C)n(C)c2ccccc12
InChI Key InChIKey=XUXNEGDCCYQQNC-UHFFFAOYSA-N
Data  5 IC50
  Tab Delimited (TSV)   2D SDfile   Computed 3D by Vconf -m prep SDfile
Find this compound or compounds like it in BindingDB:
Activity Spreadsheet -- Enzyme Inhibition Constant Data from BindingDB
Found 5 hits for monomerid = 3350
TargetEpidermal growth factor receptor(Homo sapiens (Human))
Parke-Davis Pharmaceutical Research
LigandPNGBDBM3350(CHEMBL342929 | N,1-dimethyl-2-{[1-methyl-3-(methyl...)
Affinity DataIC50:  6.90E+3nMpH: 7.4 T: 2°C. Assay description: IC50 is the inhibitor concentration which inhibits 50% of kinase activity that catalyzes the transfer of the terminal phosphate from [gamma-32P] labe...
In DepthDetails ArticlePubMed
TargetPlatelet-derived growth factor receptor beta(Mus musculus (mouse))
Parke-Davis Pharmaceutical Research
LigandPNGBDBM3350(CHEMBL342929 | N,1-dimethyl-2-{[1-methyl-3-(methyl...)
Affinity DataIC50:  2.81E+4nMpH: 7.4 T: 2°C. Assay description: IC50 is the inhibitor concentration which inhibits 50% of kinase activity that catalyzes the transfer of the terminal phosphate from [gamma-32P] labe...
In DepthDetails ArticlePubMed
TargetEpidermal growth factor receptor(Homo sapiens (Human))
Parke-Davis Pharmaceutical Research
LigandPNGBDBM3350(CHEMBL342929 | N,1-dimethyl-2-{[1-methyl-3-(methyl...)
Affinity DataIC50:  1.80E+3nM. Assay description: Inhibitory concentration compound against EFGR tyrosine kinase obtained from plasma membrane vesicles from cultured A431 cells
In DepthDetails ArticlePubMed
TargetProto-oncogene tyrosine-protein kinase Src(Homo sapiens (Human))
University Of Auckland
Curated by ChEMBL
LigandPNGBDBM3350(CHEMBL342929 | N,1-dimethyl-2-{[1-methyl-3-(methyl...)
Affinity DataIC50:  6.70E+3nM. Assay description: Inhibitory concentration of the against pp60v-src tyrosine kinase obtained from v-src baculovirus-infected insect cells
In DepthDetails ArticlePubMed
TargetTyrosine-protein kinase transforming protein Src(Avian sarcoma virus)
Parke-Davis Pharmaceutical Research
LigandPNGBDBM3350(CHEMBL342929 | N,1-dimethyl-2-{[1-methyl-3-(methyl...)
Affinity DataIC50:  6.70E+3nM. Assay description: IC50 is the inhibitor concentration which inhibits 50% of kinase activity that catalyzes the transfer of the terminal phosphate from [gamma-32P] labe...
In DepthDetails ArticlePubMed