BDBM335142 US11040966, Example 6.104::US9732075, Example 6.104::[5-(3-Bromo-phenyl)-2-methyl-thiazol-4-yl]-[(S)-2-(7-methyl-1H-benzoimidazol-2-yl)-4-methylene-pyrrolidin-1-yl]-methanone
SMILES Cc1nc(C(=O)N2CC(=C)C[C@H]2c2nc3cccc(C)c3[nH]2)c(s1)-c1cccc(Br)c1
InChI Key InChIKey=CEFUBZHXLUSJPE-IBGZPJMESA-N
Data  2 IC50
  Tab Delimited (TSV)   2D SDfile   Computed 3D by Vconf -m prep SDfile
Find this compound or compounds like it in BindingDB:
Activity Spreadsheet -- Enzyme Inhibition Constant Data from BindingDB
Found 2 hits for monomerid = 335142
TargetOrexin receptor type 2(Homo sapiens (Human))
Idorsia Pharmaceuticals
US Patent
LigandPNGBDBM335142(US11040966, Example 6.104 | US9732075, Example 6.1...)
Affinity DataIC50:  0.800nM. Assay description: Chinese hamster ovary (CHO) cells expressing the human orexin-1 receptor and the human orexin-2 receptor, respectively, are grown in culture medium (...
Ligand InfoPC cidPC sid
In DepthDetails US Patent
TargetOrexin/Hypocretin receptor type 1(Homo sapiens (Human))
Idorsia Pharmaceuticals
US Patent
LigandPNGBDBM335142(US11040966, Example 6.104 | US9732075, Example 6.1...)
Affinity DataIC50:  13nM. Assay description: Chinese hamster ovary (CHO) cells expressing the human orexin-1 receptor and the human orexin-2 receptor, respectively, are grown in culture medium (...
Ligand InfoPC cidPC sid
In DepthDetails US Patent