BDBM335418 4-(2-{(3S)-7-[5-chloro-2-(1H-tetrazol-1-yl)phenyl]-5-oxo-1,2,3,5-tetrahydro-3-indolizinyl}-1H-imidazol-5-yl)-3-fluoro-2-thiophenecarboxylic acid::US10717738, Example 834::US9732085, 834
SMILES OC(=O)c1scc(c1F)-c1cnc([nH]1)[C@@H]1CCc2cc(cc(=O)n12)-c1cc(Cl)ccc1-n1cnnn1
InChI Key InChIKey=HKFKXULCJJOCNC-SFHVURJKSA-N
Data  2 IC50
  Tab Delimited (TSV)   2D SDfile   Computed 3D by Vconf -m prep SDfile
Find this compound or compounds like it in BindingDB:
Activity Spreadsheet -- Enzyme Inhibition Constant Data from BindingDB
Found 2 hits for monomerid = 335418
TargetCoagulation factor XI(Homo sapiens (Human))
Ono Pharmaceutical
US Patent
LigandPNGBDBM335418(4-(2-{(3S)-7-[5-chloro-2-(1H-tetrazol-1-yl)phenyl]...)
Affinity DataIC50:  1.60nM. Assay description: Human Factor XIa activity was measured at an enzyme concentration of 0.1 U/mL in 150 mM NaCl, 5 mM KCl, 1 mg/mL PEG6000, 50 mM HEPES-NaOH (pH7.4) wit...
Ligand InfoPC cidPC sid
In DepthDetails US Patent
TargetCoagulation factor XI(Homo sapiens (Human))
Ono Pharmaceutical
US Patent
LigandPNGBDBM335418(4-(2-{(3S)-7-[5-chloro-2-(1H-tetrazol-1-yl)phenyl]...)
Affinity DataIC50:  1.60nM. Assay description: Human Factor XIa (Haematologic Technologies Inc.) activity was measured at an enzyme concentration of 0.1 U/mL in 150 mM NaCl, 5 mM KCl, 1 mg/mL PEG6...
Ligand InfoPC cidPC sid
In DepthDetails US Patent