BDBM335435 N-(Cyclopropylmethyl)-4-piperazin-1-ylpyridin-2-amine::US9732087, 35
SMILES C(Nc1cc(ccn1)N1CCNCC1)C1CC1
InChI Key InChIKey=UZLHBGZXOOPWEB-UHFFFAOYSA-N
Data  1 KI
  Tab Delimited (TSV)   2D SDfile   Computed 3D by Vconf -m prep SDfile
Find this compound or compounds like it in BindingDB:
Activity Spreadsheet -- Enzyme Inhibition Constant Data from BindingDB
Found 1 hit for monomerid = 335435
TargetHistamine H4 receptor(Homo sapiens (Human))
Janssen Pharmaceutica
US Patent
LigandPNGBDBM335435(N-(Cyclopropylmethyl)-4-piperazin-1-ylpyridin-2-am...)
Affinity DataKi:  25.6nM. Assay description: Cell pellets from SK-N-MC cells stably or transiently transfected with human H4 receptor (NCBI accession No. AF312230) were used for the binding assa...
Ligand InfoPC cidPC sid
In DepthDetails US Patent