BDBM335441 Isobutyl-(4-piperazin-1-yl-pyrimidin-2-yl)-amine::US9732087, 65
SMILES CC(C)CNc1nccc(n1)N1CCNCC1
InChI Key InChIKey=HDAPAMWFKVMXKW-UHFFFAOYSA-N
Data  1 KI
  Tab Delimited (TSV)   2D SDfile   Computed 3D by Vconf -m prep SDfile
Find this compound or compounds like it in BindingDB:
Activity Spreadsheet -- Enzyme Inhibition Constant Data from BindingDB
Found 1 hit for monomerid = 335441
TargetHistamine H4 receptor(Homo sapiens (Human))
Janssen Pharmaceutica
US Patent
LigandPNGBDBM335441(Isobutyl-(4-piperazin-1-yl-pyrimidin-2-yl)-amine |...)
Affinity DataKi:  46.3nM. Assay description: Cell pellets from SK-N-MC cells stably or transiently transfected with human H4 receptor (NCBI accession No. AF312230) were used for the binding assa...
In DepthDetails US Patent