BDBM335525 (2S,4R)-1-(2-(3-acetyl-6-(N- tert-butylsulfamoylmethoxy)- 1H-indol-1-yl)acetyl)-N-(3- chloro-2-fluorobenzyl)-4- fluoropyrrolidine-2- carboxamide::US10550140, Compound 15::US9732104, Compound 15
SMILES CC(=O)c1cn(CC(=O)N2C[C@H](F)C[C@H]2C(=O)NCc2cccc(Cl)c2F)c2cc(OCS(=O)(=O)NC(C)(C)C)ccc12
InChI Key InChIKey=OZXAEMPXXLBLGN-CLOONOSVSA-N
Data  2 IC50
  Tab Delimited (TSV)   2D SDfile   Computed 3D by Vconf -m prep SDfile
Find this compound or compounds like it in BindingDB:
Activity Spreadsheet -- Enzyme Inhibition Constant Data from BindingDB
Found 2 hits for monomerid = 335525
TargetComplement factor D(Homo sapiens (Human))
Achillion Pharmaceuticals
US Patent
LigandPNGBDBM335525((2S,4R)-1-(2-(3-acetyl-6-(N- tert-butylsulfamoylme...)
Affinity DataIC50: <1.00E+3nM. Assay description: Human factor D (purified from human serum, Complement Technology, Inc.) at 80 nM final concentration is incubated with test compound at various conce...
Ligand InfoPC cidPC sid
In DepthDetails US Patent
TargetComplement factor D(Homo sapiens (Human))
Achillion Pharmaceuticals
US Patent
LigandPNGBDBM335525((2S,4R)-1-(2-(3-acetyl-6-(N- tert-butylsulfamoylme...)
Affinity DataIC50: <1.00E+3nM. Assay description: Human factor D (purified from human serum, Complement Technology, Inc.) at 80 nM final concentration is incubated with test compound at various conce...
Ligand InfoPC cidPC sid
In DepthDetails US Patent