BDBM335586 5-((hexahydropyrrolo[3,4-c]pyrrol-2(1H)-yl)methyl)-N-(3-(5-isopropyl-1,3,4-thiadiazol-2-yl)phenyl)pyrrolo[2,1-f][1,2,4]triazin-4-amine::US9737542, Example 29
SMILES CC(C)c1nnc(s1)-c1cccc(Nc2ncnn3ccc(CN4CC5CNCC5C4)c23)c1
InChI Key InChIKey=UHBUAOREWGATNX-UHFFFAOYSA-N
Data  1 IC50
  Tab Delimited (TSV)   2D SDfile   Computed 3D by Vconf -m prep SDfile
Find this compound or compounds like it in BindingDB:
Activity Spreadsheet -- Enzyme Inhibition Constant Data from BindingDB
Found 1 hit for monomerid = 335586
TargetAP2-associated protein kinase 1(Homo sapiens (Human))
Bristol-Myers Squibb
US Patent
LigandPNGBDBM335586(5-((hexahydropyrrolo[3,4-c]pyrrol-2(1H)-yl)methyl)...)
Affinity DataIC50:  550nM. Assay description: The assays were performed in U-bottom 384-well plates. The final assay volume was 30 μl prepared from 15 μl additions of enzyme and substra...
Ligand InfoPC cidPC sid
In DepthDetails US Patent